Information card for entry 7008756
Formula | C58 H64.5 Br6 Cu4 N10 O10.25 |
Calculated formula | C58 H60 Br6 Cu4 N10 O10.262 |
Title of publication | Ferromagnetism in dinuclear copper(ii)-phenolate complexes with exogenous O-donor bridges: a comparative study |
Authors of publication | Fondo, Matilde; Ocampo, Noelia; García-Deibe, Ana M.; Corbella, Montserrat; Bermejo, Manuel R.; Sanmartín, Jesús |
Journal of publication | Dalton Transactions |
Year of publication | 2005 |
Journal issue | 23 |
Pages of publication | 3785 |
a | 12.6006 ± 0.0014 Å |
b | 16.1358 ± 0.0018 Å |
c | 16.2462 ± 0.0018 Å |
α | 85.798 ± 0.002° |
β | 80.565 ± 0.002° |
γ | 77.818 ± 0.002° |
Cell volume | 3182.6 ± 0.6 Å3 |
Cell temperature | 123 ± 2 K |
Ambient diffraction temperature | 120 ± 2 K |
Number of distinct elements | 6 |
Space group number | 2 |
Hermann-Mauguin space group symbol | P -1 |
Hall space group symbol | -P 1 |
Residual factor for all reflections | 0.0721 |
Residual factor for significantly intense reflections | 0.0355 |
Weighted residual factors for significantly intense reflections | 0.067 |
Weighted residual factors for all reflections included in the refinement | 0.0786 |
Goodness-of-fit parameter for all reflections included in the refinement | 1.03 |
Diffraction radiation wavelength | 0.71073 Å |
Diffraction radiation type | MoKα |