Information card for entry 7008886
Formula | C12 H12 Mn N8 |
Calculated formula | C12 Mn N8 |
Title of publication | Structural analysis and magnetic properties of the 2-D compounds [M(N3)2(bpa)]n (M = Mn, Co or Ni; bpa = 1,2-bis(4-pyridyl)ethane) † |
Authors of publication | Hernández, Margarita L.; Barandika, M. Gotzone; Urtiaga, M. Karmele; Cortés, Roberto; Lezama, Luis; Arriortua, M. Isabel |
Journal of publication | Journal of the Chemical Society, Dalton Transactions |
Year of publication | 2000 |
Journal issue | 1 |
Pages of publication | 79 |
a | 9.991 ± 0.003 Å |
b | 13.883 ± 0.002 Å |
c | 10.482 ± 0.003 Å |
α | 90° |
β | 103.15 ± 0.02° |
γ | 90° |
Cell volume | 1415.8 ± 0.6 Å3 |
Cell temperature | 293 ± 2 K |
Ambient diffraction temperature | 293 ± 2 K |
Number of distinct elements | 4 |
Space group number | 15 |
Hermann-Mauguin space group symbol | C 1 2/c 1 |
Hall space group symbol | -C 2yc |
Residual factor for all reflections | 0.0907 |
Residual factor for significantly intense reflections | 0.0552 |
Weighted residual factors for significantly intense reflections | 0.135 |
Weighted residual factors for all reflections included in the refinement | 0.1659 |
Goodness-of-fit parameter for all reflections included in the refinement | 1.024 |
Diffraction radiation wavelength | 0.7107 Å |
Diffraction radiation type | MoKα |