Information card for entry 7008973
Formula | C14 H14 Cu2 N8 O15 |
Calculated formula | C14 H14 Cu2 N8 O15 |
Title of publication | Syntheses, crystal structures and magnetic properties of dinuclear copper(II) complexes with pyrazino[2,3-f ][4,7]phenanthroline (pap) as bridging ligand |
Authors of publication | Grove, Hilde; Sletten, Jorunn; Julve, Miguel; Lloret, Francesc |
Journal of publication | Journal of the Chemical Society, Dalton Transactions |
Year of publication | 2000 |
Journal issue | 4 |
Pages of publication | 515 |
a | 8.7332 ± 0.0003 Å |
b | 9.0065 ± 0.0003 Å |
c | 27.6888 ± 0.0004 Å |
α | 90° |
β | 98.149 ± 0.002° |
γ | 90° |
Cell volume | 2155.89 ± 0.11 Å3 |
Cell temperature | 173 ± 2 K |
Ambient diffraction temperature | 173 ± 2 K |
Number of distinct elements | 5 |
Space group number | 14 |
Hermann-Mauguin space group symbol | P 1 21/n 1 |
Hall space group symbol | -P 2yn |
Residual factor for all reflections | 0.0605 |
Residual factor for significantly intense reflections | 0.0347 |
Weighted residual factors for all reflections | 0.0805 |
Weighted residual factors for significantly intense reflections | 0.0703 |
Goodness-of-fit parameter for all reflections | 1.016 |
Goodness-of-fit parameter for significantly intense reflections | 1.054 |
Diffraction radiation wavelength | 0.71073 Å |
Diffraction radiation type | MoKα |