Information card for entry 7009062
Formula | C36 H48 In P Te3 |
Calculated formula | C36 H48 In P Te3 |
SMILES | [In]([Te]c1ccccc1)([Te]c1ccccc1)([Te]c1ccccc1)[P](C1CCCCC1)(C1CCCCC1)C1CCCCC1 |
Title of publication | Phosphine and phosphido indium hydride complexes and their use in inorganic synthesis |
Authors of publication | Cole, Marcus L.; Hibbs, David E.; Jones, Cameron; Smithies, Neil A. |
Journal of publication | Journal of the Chemical Society, Dalton Transactions |
Year of publication | 2000 |
Journal issue | 4 |
Pages of publication | 545 |
a | 10.3689 ± 0.001 Å |
b | 12.0296 ± 0.0019 Å |
c | 15.862 ± 0.002 Å |
α | 85.164 ± 0.009° |
β | 82.62 ± 0.02° |
γ | 72.022 ± 0.01° |
Cell volume | 1864.2 ± 0.4 Å3 |
Cell temperature | 150 ± 2 K |
Ambient diffraction temperature | 293 ± 2 K |
Number of distinct elements | 5 |
Space group number | 2 |
Hermann-Mauguin space group symbol | P -1 |
Hall space group symbol | -P 1 |
Residual factor for all reflections | 0.1498 |
Residual factor for significantly intense reflections | 0.0653 |
Weighted residual factors for significantly intense reflections | 0.1487 |
Weighted residual factors for all reflections included in the refinement | 0.17 |
Goodness-of-fit parameter for all reflections included in the refinement | 1.28 |
Diffraction radiation wavelength | 0.71073 Å |
Diffraction radiation type | MoKα |