Information card for entry 7009139
Formula | C14 H16 Cl Cu N4 O4 |
Calculated formula | C14 H16 Cl Cu N4 O4 |
Title of publication | Construction of co-ordination networks of 1,6-bis(4'-pyridyl)-2,5-diazahexane with silver(I) and copper(I). Structural diversity through change in metal ions and counter ions |
Authors of publication | Fei, Bao-Li; Sun, Wei-Yin; Yu, Kai-Bei; Tang, Wen-Xia |
Journal of publication | Journal of the Chemical Society, Dalton Transactions |
Year of publication | 2000 |
Journal issue | 5 |
Pages of publication | 805 |
a | 9.055 ± 0.002 Å |
b | 10.734 ± 0.002 Å |
c | 18.338 ± 0.003 Å |
α | 90° |
β | 90° |
γ | 90° |
Cell volume | 1782.4 ± 0.6 Å3 |
Cell temperature | 296 ± 2 K |
Ambient diffraction temperature | 296 ± 2 K |
Number of distinct elements | 6 |
Space group number | 19 |
Hermann-Mauguin space group symbol | P 21 21 21 |
Hall space group symbol | P 2ac 2ab |
Residual factor for all reflections | 0.1021 |
Residual factor for significantly intense reflections | 0.0426 |
Weighted residual factors for all reflections | 0.1004 |
Weighted residual factors for significantly intense reflections | 0.0868 |
Goodness-of-fit parameter for all reflections | 0.801 |
Goodness-of-fit parameter for significantly intense reflections | 1.063 |
Diffraction radiation wavelength | 0.71073 Å |
Diffraction radiation type | MoKα |