Information card for entry 7009200
Formula | C1.75 H5 Al2.4 N0.5 O12.5 P3 Zn0.6 |
Calculated formula | C1.82 Al2.4 N0.52 O12.5 P3 Zn0.6 |
Title of publication | Cation-directed syntheses of novel zeolite-like metalloaluminophosphates STA-6 and STA-7 in the presence of azamacrocycle templates |
Authors of publication | Wright, Paul A.; Maple, Martin J.; Slawin, Alexandra M. Z.; Patinec, Véronique; Aitken, R. Alan; Welsh, Simon; Cox, Paul A. |
Journal of publication | Journal of the Chemical Society, Dalton Transactions |
Year of publication | 2000 |
Journal issue | 8 |
Pages of publication | 1243 |
a | 18.691 ± 0.002 Å |
b | 18.691 ± 0.002 Å |
c | 9.423 ± 0.001 Å |
α | 90° |
β | 90° |
γ | 90° |
Cell volume | 3292 ± 0.6 Å3 |
Cell temperature | 150 ± 2 K |
Ambient diffraction temperature | 150 ± 2 K |
Number of distinct elements | 7 |
Space group number | 85 |
Hermann-Mauguin space group symbol | P 4/n :2 |
Hall space group symbol | -P 4a |
Residual factor for all reflections | 0.1189 |
Residual factor for significantly intense reflections | 0.0912 |
Weighted residual factors for all reflections | 0.2595 |
Weighted residual factors for significantly intense reflections | 0.2203 |
Goodness-of-fit parameter for all reflections | 1.234 |
Goodness-of-fit parameter for significantly intense reflections | 1.311 |
Diffraction radiation wavelength | 0.6884 Å |
Diffraction radiation type | synchrotron |