Information card for entry 7009251
Common name | compound 6e(Ni) |
Formula | C42 H66 Co2 F10 Ni2 O24 P6 |
Calculated formula | C42 H46 Co2 F10 Ni2 O24 P6 |
Title of publication | An entry to half-sandwich complexes of first row transition metals (Ni, Co, Mn) containing the Kläui tripodal ligand, LOMe: synthesis and crystal structures of oligomeric, [LOMeM(μ-X)(L)]n (n = 2, 4), and monomeric complexes, LOMeM(L2)(X) |
Authors of publication | De-qiang Ma; Shiro Hikichi; Munetaka Akita; Yoshihiko Moro-oka |
Journal of publication | J. Chem. Soc., Dalton Trans. |
Year of publication | 2000 |
Journal issue | 7 |
Pages of publication | 1123 - 1134 |
a | 9.2507 ± 0.0014 Å |
b | 28.276 ± 0.008 Å |
c | 12.14 ± 0.002 Å |
α | 90° |
β | 100.241 ± 0.009° |
γ | 90° |
Cell volume | 3124.9 ± 1.1 Å3 |
Cell temperature | 213 ± 2 K |
Ambient diffraction temperature | 213 ± 2 K |
Number of distinct elements | 7 |
Space group number | 14 |
Hermann-Mauguin space group symbol | P 1 21/a 1 |
Hall space group symbol | -P 2yab |
Residual factor for all reflections | 0.094 |
Residual factor for significantly intense reflections | 0.0894 |
Weighted residual factors for significantly intense reflections | 0.2336 |
Weighted residual factors for all reflections included in the refinement | 0.2371 |
Goodness-of-fit parameter for all reflections included in the refinement | 2.101 |
Diffraction radiation wavelength | 0.7107 Å |
Diffraction radiation type | MoKα |