Information card for entry 7009350
Formula | C35 H50 F12 N4 O P2 Rh2 S2 |
Calculated formula | C35 H30 F12 N4 O P2 Rh2 S2 |
Title of publication | Structural difference due to intramolecular stacking interactions in dinuclear rhodium(III) complexes [{Rh(η5-C5Me5)(L)}2]n+ containing pyrimidine-2-thionate and related ligands |
Authors of publication | Yamanari, Kazuaki; Fukuda, Ito; Yamamoto, Shiori; Kushi, Yoshihiko; Fuyuhiro, Akira; Kubota, Naoko; Fukuo, Tsuyoshi; Arakawa, Ryuichi |
Journal of publication | Journal of the Chemical Society, Dalton Transactions |
Year of publication | 2000 |
Journal issue | 13 |
Pages of publication | 2131 |
a | 15.727 ± 0.004 Å |
b | 13.366 ± 0.003 Å |
c | 21.707 ± 0.002 Å |
α | 90° |
β | 98.32 ± 0.01° |
γ | 90° |
Cell volume | 4514.9 ± 1.6 Å3 |
Cell temperature | 296.2 K |
Ambient diffraction temperature | 296.2 K |
Number of distinct elements | 8 |
Space group number | 14 |
Hermann-Mauguin space group symbol | P 1 21/a 1 |
Hall space group symbol | -P 2yab |
Residual factor for all reflections | 0.0523 |
Residual factor for significantly intense reflections | 0.0523 |
Weighted residual factors for significantly intense reflections | 0.0691 |
Weighted residual factors for all reflections included in the refinement | 0.0691 |
Goodness-of-fit parameter for all reflections included in the refinement | 2.184 |
Diffraction radiation wavelength | 0.7107 Å |
Diffraction radiation type | MoKα |