Information card for entry 7009408
Formula | C23 H38 Cl2 Cu N6 O9 |
Calculated formula | C23 H34 Cl2 Cu N6 O9 |
Title of publication | Copper(II) complexes of the isomeric tetraazamacrocyclic ligands 1,11- and 1,8-bis(2-pyridylmethyl)-1,4,8,11-tetraazacyclotetradecane and of the 1,4,8,11-tetraazacyclotetradecane-5,12-dione analogue at neutral and basic pH |
Authors of publication | Goeta, Andrés E.; Howard, Judith A. K.; Maffeo, Davide; Puschmann, Horst; Williams, J. A. Gareth; Yufit, Dimitrii S. |
Journal of publication | Journal of the Chemical Society, Dalton Transactions |
Year of publication | 2000 |
Journal issue | 12 |
Pages of publication | 1873 |
a | 8.27 ± 0.001 Å |
b | 18.666 ± 0.002 Å |
c | 18.717 ± 0.002 Å |
α | 90° |
β | 97.879 ± 0.003° |
γ | 90° |
Cell volume | 2862 ± 0.6 Å3 |
Cell temperature | 150 ± 2 K |
Ambient diffraction temperature | 150 ± 2 K |
Number of distinct elements | 6 |
Space group number | 14 |
Hermann-Mauguin space group symbol | P 1 21/c 1 |
Hall space group symbol | -P 2ybc |
Residual factor for all reflections | 0.0841 |
Residual factor for significantly intense reflections | 0.06 |
Weighted residual factors for significantly intense reflections | 0.1371 |
Weighted residual factors for all reflections included in the refinement | 0.1479 |
Goodness-of-fit parameter for all reflections included in the refinement | 1.103 |
Diffraction radiation wavelength | 0.71073 Å |
Diffraction radiation type | MoKα |