Information card for entry 7009470
Formula | C37 H59 Mg N2 O |
Calculated formula | C37 H59 Mg N2 O |
Title of publication | Synthesis and characterisation of magnesium methyl complexes with monoanionic chelating nitrogen donor ligands and their reaction with dioxygen |
Authors of publication | Bailey, Philip J.; Dick, Caroline M. E.; Fabre, Sylvie; Parsons, Simon |
Journal of publication | Journal of the Chemical Society, Dalton Transactions |
Year of publication | 2000 |
Journal issue | 10 |
Pages of publication | 1655 |
a | 9.136 ± 0.003 Å |
b | 12.69 ± 0.005 Å |
c | 16.004 ± 0.006 Å |
α | 99 ± 0.03° |
β | 96.17 ± 0.03° |
γ | 95.19 ± 0.02° |
Cell volume | 1811.1 ± 1.2 Å3 |
Cell temperature | 220 ± 2 K |
Ambient diffraction temperature | 220 ± 2 K |
Number of distinct elements | 5 |
Space group number | 2 |
Hermann-Mauguin space group symbol | P -1 |
Hall space group symbol | -P 1 |
Residual factor for all reflections | 0.1767 |
Residual factor for significantly intense reflections | 0.084 |
Weighted residual factors for significantly intense reflections | 0.1912 |
Weighted residual factors for all reflections included in the refinement | 0.2445 |
Goodness-of-fit parameter for all reflections included in the refinement | 0.961 |
Diffraction radiation wavelength | 1.54178 Å |
Diffraction radiation type | CuKα |