Information card for entry 7009515
Formula | C11 H23 N2 O2 Re S3 |
Calculated formula | C10.5 H22 N2 O2 Re S3 |
Title of publication | Neutral '3 + 1' mixed-ligand oxorhenium(V) complexes with tridentate [S,N,S] chelates and aminoalkanethiols: synthesis, characterization and structure determination ‡ |
Authors of publication | Friebe, Matthias; Spies, Hartmut; Seichter, Wilhelm; Leibnitz, Peter; Johannsen, Bernd |
Journal of publication | Journal of the Chemical Society, Dalton Transactions |
Year of publication | 2000 |
Journal issue | 14 |
Pages of publication | 2471 |
a | 11.767 ± 0.003 Å |
b | 11.422 ± 0.009 Å |
c | 13.299 ± 0.006 Å |
α | 90° |
β | 111.11 ± 0.04° |
γ | 90° |
Cell volume | 1667.5 ± 1.6 Å3 |
Cell temperature | 296 ± 2 K |
Ambient diffraction temperature | 296 ± 2 K |
Number of distinct elements | 6 |
Space group number | 14 |
Hermann-Mauguin space group symbol | P 1 21/n 1 |
Hall space group symbol | -P 2yn |
Residual factor for all reflections | 0.0905 |
Residual factor for significantly intense reflections | 0.0542 |
Weighted residual factors for significantly intense reflections | 0.1632 |
Weighted residual factors for all reflections included in the refinement | 0.1725 |
Goodness-of-fit parameter for all reflections included in the refinement | 1.286 |
Diffraction radiation wavelength | 0.71069 Å |
Diffraction radiation type | MoKα |