Information card for entry 7009522
Formula | C12 H9 Au N2 O4 S2 |
Calculated formula | C13.5 H10.125 Au0.5625 N2.25 O4.5 S2.25 |
Title of publication | Synthesis and crystal structure of a hexanuclear silver(I) cluster [Ag(Hmna)]6·4H2O (H2mna = 2-mercaptonicotinic acid) and a supramolecular gold(I) complex H[Au(Hmna)2] in the solid state, and their antimicrobial activities |
Authors of publication | Nomiya, Kenji; Takahashi, Satoshi; Noguchi, Ryusuke |
Journal of publication | Journal of the Chemical Society, Dalton Transactions |
Year of publication | 2000 |
Journal issue | 13 |
Pages of publication | 2091 |
a | 15.554 ± 0.003 Å |
b | 15.5541 Å |
c | 31.26 ± 0.005 Å |
α | 90° |
β | 90° |
γ | 120° |
Cell volume | 6549.5 ± 1.6 Å3 |
Cell temperature | 296.2 K |
Ambient diffraction temperature | 296.2 K |
Number of distinct elements | 6 |
Space group number | 167 |
Hermann-Mauguin space group symbol | R -3 c :H |
Hall space group symbol | -R 3 2"c |
Residual factor for all reflections | 0.038 |
Residual factor for significantly intense reflections | 0.038 |
Weighted residual factors for all reflections | 0.038 |
Weighted residual factors for all reflections included in the refinement | 0.038 |
Goodness-of-fit parameter for all reflections | 1.222 |
Goodness-of-fit parameter for all reflections included in the refinement | 1.22 |
Diffraction radiation wavelength | 0.7107 Å |
Diffraction radiation type | MoKα |