Information card for entry 7009784
Formula | C28 H35 B Cu N6 P |
Calculated formula | C28 H35 B Cu N6 P |
SMILES | [Cu]12([P](c3ccccc3)(c3ccccc3)C)[n]3n(c(cc3C)C)[BH](n3[n]1c(cc3C)C)n1[n]2c(cc1C)C |
Title of publication | Synthesis, spectroscopic characterization, and structural systematics of new triorganophosphinecopper(I) poly(pyrazol-1-yl)borate complexes † |
Authors of publication | Pellei, Maura; Pettinari, Claudio; Santini, Carlo; Skelton, Brian W.; Somers, Neil; White, Allan H. |
Journal of publication | Journal of the Chemical Society, Dalton Transactions |
Year of publication | 2000 |
Journal issue | 19 |
Pages of publication | 3416 |
a | 14.479 ± 0.002 Å |
b | 18.019 ± 0.003 Å |
c | 21.808 ± 0.004 Å |
α | 90° |
β | 90° |
γ | 90° |
Cell volume | 5689.6 ± 1.6 Å3 |
Cell temperature | 153 K |
Ambient diffraction temperature | 153 K |
Number of distinct elements | 6 |
Space group number | 61 |
Hermann-Mauguin space group symbol | P b c a |
Hall space group symbol | -P 2ac 2ab |
Residual factor for all reflections | 0.051 |
Residual factor for significantly intense reflections | 0.036 |
Weighted residual factors for all reflections | 0.047 |
Weighted residual factors for all reflections included in the refinement | 0.046 |
Goodness-of-fit parameter for all reflections | 1.45 |
Goodness-of-fit parameter for all reflections included in the refinement | 1.584 |
Diffraction radiation wavelength | 0.71073 Å |
Diffraction radiation type | MoKα |