Information card for entry 7009801
Common name | 1-2PhH |
Formula | C32 H28 N6 Ni O6 |
Calculated formula | C32 H28 N6 Ni O6 |
Title of publication | Coexisting covalent and non-covalent planar networks in the crystal structures of {[M(bipy)2(NO3)2]·arene}n (M = Ni, 1; Co, 2; arene = chlorobenzene, o-dichlorobenzene, benzene, nitrobenzene, toluene or anisole) † |
Authors of publication | Biradha, Kumar; Mondal, Arunendu; Moulton, Brian; Zaworotko, Michael J. |
Journal of publication | Journal of the Chemical Society, Dalton Transactions |
Year of publication | 2000 |
Journal issue | 21 |
Pages of publication | 3837 |
a | 21.164 ± 0.002 Å |
b | 11.4128 ± 0.0009 Å |
c | 12.6597 ± 0.001 Å |
α | 90° |
β | 101.206 ± 0.001° |
γ | 90° |
Cell volume | 2999.5 ± 0.4 Å3 |
Cell temperature | 293 ± 2 K |
Ambient diffraction temperature | 293 ± 2 K |
Number of distinct elements | 5 |
Space group number | 15 |
Hermann-Mauguin space group symbol | C 1 2/c 1 |
Hall space group symbol | -C 2yc |
Residual factor for all reflections | 0.0684 |
Residual factor for significantly intense reflections | 0.0449 |
Weighted residual factors for all reflections | 0.1179 |
Weighted residual factors for significantly intense reflections | 0.1085 |
Goodness-of-fit parameter for all reflections | 1.038 |
Goodness-of-fit parameter for significantly intense reflections | 1.108 |
Diffraction radiation wavelength | 0.71073 Å |
Diffraction radiation type | MoKα |