Information card for entry 7009843
Formula | C60 H53 F12 N15 O2 P2 Ru2 |
Calculated formula | C60 H49 F12 N15 O1.5 P2 Ru2 |
Title of publication | Bis(R-bipyridyl)ruthenium bibenzimidazole complexes (R = H, Me or But): supramolecular arrangement via hydrogen bonds, photo- and electro-chemical properties and reactivity towards carbon dioxide |
Authors of publication | Sven Rau; Mario Ruben; Torsten Büttner; Christian Temme; Sylvana Dautz; Helmar Görls; Manfred Rudolph; Dirk Walther; Andre Brodkorb; Marco Duati; Christine O'Connor; Johannes G. Vos |
Journal of publication | J. Chem. Soc., Dalton Trans. |
Year of publication | 2000 |
Journal issue | 20 |
Pages of publication | 3649 - 3657 |
a | 24.474 ± 0.002 Å |
b | 13.921 ± 0.001 Å |
c | 19.433 ± 0.001 Å |
α | 90° |
β | 106.843 ± 0.003° |
γ | 90° |
Cell volume | 6336.9 ± 0.8 Å3 |
Cell temperature | 183 ± 2 K |
Ambient diffraction temperature | 183 ± 2 K |
Number of distinct elements | 7 |
Space group number | 15 |
Hermann-Mauguin space group symbol | C 1 2/c 1 |
Hall space group symbol | -C 2yc |
Residual factor for all reflections | 0.0635 |
Residual factor for significantly intense reflections | 0.0483 |
Weighted residual factors for all reflections | 0.1411 |
Weighted residual factors for significantly intense reflections | 0.1246 |
Goodness-of-fit parameter for all reflections | 1.078 |
Goodness-of-fit parameter for significantly intense reflections | 1.107 |
Diffraction radiation wavelength | 0.71073 Å |
Diffraction radiation type | MoKα |