Information card for entry 7009891
Formula | C40 H70 P4 Pt2 S |
Calculated formula | C40 H70 P4 Pt2 S |
SMILES | [Pt]([P](CC)(CC)CC)([P](CC)(CC)CC)(c1ccccc1)C#CSC#C[Pt]([P](CC)(CC)CC)([P](CC)(CC)CC)c1ccccc1 |
Title of publication | Synthesis, structures and properties of platinum(II) complexes of oligoacetylenic sulfides |
Authors of publication | Zhang, Hongkui; Lee, Albert W. M.; Wong, Wai-Yeung; Yuen, Mabel S. M. |
Journal of publication | Journal of the Chemical Society, Dalton Transactions |
Year of publication | 2000 |
Journal issue | 20 |
Pages of publication | 3675 |
a | 21.205 ± 0.004 Å |
b | 9.0533 ± 0.0018 Å |
c | 24.43 ± 0.005 Å |
α | 90° |
β | 95.67 ± 0.03° |
γ | 90° |
Cell volume | 4667 ± 1.6 Å3 |
Cell temperature | 293 ± 2 K |
Ambient diffraction temperature | 293 ± 2 K |
Number of distinct elements | 5 |
Space group number | 14 |
Hermann-Mauguin space group symbol | P 1 21/n 1 |
Hall space group symbol | -P 2yn |
Residual factor for all reflections | 0.0531 |
Residual factor for significantly intense reflections | 0.0291 |
Weighted residual factors for significantly intense reflections | 0.0845 |
Weighted residual factors for all reflections included in the refinement | 0.1085 |
Goodness-of-fit parameter for all reflections included in the refinement | 0.704 |
Diffraction radiation wavelength | 0.71073 Å |
Diffraction radiation type | MoKα |