Information card for entry 7009972
Formula | C5 H16 Cs I2 N3 O6 Pt |
Calculated formula | C5 H8 Cs I2 N3 O6 Pt |
Title of publication | Exocyclic oxygen atoms of platinated nucleobases as binding sites for alkali metal ions |
Authors of publication | Freisinger, Eva; Schneider, Alexandra; Drumm, Markus; Hegmans, Alexander; Meier, Susanne; Lippert, Bernhard |
Journal of publication | Journal of the Chemical Society, Dalton Transactions |
Year of publication | 2000 |
Journal issue | 19 |
Pages of publication | 3281 |
a | 7.167 ± 0.001 Å |
b | 12.9 ± 0.003 Å |
c | 18.697 ± 0.004 Å |
α | 90° |
β | 98.3 ± 0.03° |
γ | 90° |
Cell volume | 1710.5 ± 0.6 Å3 |
Cell temperature | 293 ± 2 K |
Ambient diffraction temperature | 293 ± 2 K |
Number of distinct elements | 7 |
Space group number | 14 |
Hermann-Mauguin space group symbol | P 1 21/n 1 |
Hall space group symbol | -P 2yn |
Residual factor for all reflections | 0.0556 |
Residual factor for significantly intense reflections | 0.0422 |
Weighted residual factors for all reflections | 0.1003 |
Weighted residual factors for significantly intense reflections | 0.0943 |
Goodness-of-fit parameter for all reflections | 0.963 |
Goodness-of-fit parameter for significantly intense reflections | 1.046 |
Diffraction radiation wavelength | 0.71069 Å |
Diffraction radiation type | MoKα |