Information card for entry 7010049
Formula | C24 H30 Cl2 N6 Ni O8 |
Calculated formula | C24 H30 Cl2 N6 Ni O8 |
Title of publication | Divalent first-row transition metal complexes of the rigid pendant-arm ligand 1,4,7-tris(2-aminophenyl)-1,4,7-triazacyclononane † |
Authors of publication | Fallis, Ian A.; Farley, Richard D.; Malik, K. M. Abdul; Murphy, Damien M.; Smith, Hayley J. |
Journal of publication | Journal of the Chemical Society, Dalton Transactions |
Year of publication | 2000 |
Journal issue | 20 |
Pages of publication | 3632 |
a | 14.282 ± 0.004 Å |
b | 13.765 ± 0.005 Å |
c | 28.182 ± 0.004 Å |
α | 90° |
β | 90° |
γ | 90° |
Cell volume | 5540 ± 3 Å3 |
Cell temperature | 293 ± 2 K |
Ambient diffraction temperature | 293 ± 2 K |
Number of distinct elements | 6 |
Space group number | 61 |
Hermann-Mauguin space group symbol | P b c a |
Hall space group symbol | -P 2ac 2ab |
Residual factor for all reflections | 0.182 |
Residual factor for significantly intense reflections | 0.0672 |
Weighted residual factors for all reflections | 0.1801 |
Weighted residual factors for significantly intense reflections | 0.1499 |
Goodness-of-fit parameter for all reflections | 0.957 |
Goodness-of-fit parameter for significantly intense reflections | 1.204 |
Diffraction radiation wavelength | 0.71073 Å |
Diffraction radiation type | MoKα |