Information card for entry 7010152
Common name | [Cd2(4-apy)3(NO3)4](CH2Cl2)(H2O)2 |
Chemical name | Cadmium 4,4'-azopyridine Nitrate Complex, water/dichloromethane solvate |
Formula | C15.5 H15 Cd Cl N8 O7 |
Calculated formula | C15.5 H13 Cd Cl N8 O7 |
Title of publication | Engineering of co-ordination polymers of trans-4,4'-azobis(pyridine) and trans-1,2-bis(pyridin-4-yl)ethene: a range of interpenetrated network motifs |
Authors of publication | Withersby, Matthew A.; Blake, Alexander J.; Champness, Neil R.; Cooke, Paul A.; Hubberstey, Peter; Realf, Annabel L.; Teat, Simon J.; Schröder, Martin |
Journal of publication | Journal of the Chemical Society, Dalton Transactions |
Year of publication | 2000 |
Journal issue | 19 |
Pages of publication | 3261 |
a | 21.197 ± 0.005 Å |
b | 11.166 ± 0.012 Å |
c | 21.389 ± 0.004 Å |
α | 90° |
β | 122.24 ± 0.02° |
γ | 90° |
Cell volume | 4282 ± 5 Å3 |
Cell temperature | 150 ± 2 K |
Ambient diffraction temperature | 150 ± 2 K |
Number of distinct elements | 6 |
Space group number | 15 |
Hermann-Mauguin space group symbol | C 1 2/c 1 |
Hall space group symbol | -C 2yc |
Residual factor for all reflections | 0.0577 |
Residual factor for significantly intense reflections | 0.045 |
Weighted residual factors for significantly intense reflections | 0.1024 |
Weighted residual factors for all reflections included in the refinement | 0.1184 |
Goodness-of-fit parameter for all reflections included in the refinement | 1.164 |
Diffraction radiation wavelength | 0.71073 Å |
Diffraction radiation type | MoKα |