Information card for entry 7010156
Formula | C10 H12 Ag2 N2 O6 |
Calculated formula | C10 H12 Ag2 N2 O6 |
Title of publication | Water-soluble silver(I) complexes of (R)-(+)- and (S )-(−)-2-pyrrolidone-5-carboxylic acid and their antimicrobial activities. Chiral helical polymer and polymer sheet structures in the solid-state formed by self-assembly of dimeric [Ag(Hpyrrld)]2 cores |
Authors of publication | Nomiya, Kenji; Takahashi, Satoshi; Noguchi, Ryusuke |
Journal of publication | Journal of the Chemical Society, Dalton Transactions |
Year of publication | 2000 |
Journal issue | 23 |
Pages of publication | 4369 |
a | 7.459 ± 0.001 Å |
b | 5.312 ± 0.005 Å |
c | 15.961 ± 0.001 Å |
α | 90° |
β | 92.11 ± 0.01° |
γ | 90° |
Cell volume | 632 ± 0.6 Å3 |
Cell temperature | 296.2 K |
Ambient diffraction temperature | 296.2 K |
Number of distinct elements | 5 |
Space group number | 14 |
Hermann-Mauguin space group symbol | P 1 21/n 1 |
Hall space group symbol | -P 2yn |
Residual factor for all reflections | 0.0339 |
Residual factor for significantly intense reflections | 0.034 |
Weighted residual factors for all reflections | 0.025 |
Weighted residual factors for all reflections included in the refinement | 0.025 |
Goodness-of-fit parameter for all reflections | 1.233 |
Goodness-of-fit parameter for all reflections included in the refinement | 1.23 |
Diffraction radiation wavelength | 0.7107 Å |
Diffraction radiation type | MoKα |