Information card for entry 7010393
Formula | C18 H48 Cl4 Cu2 N8 O16 |
Calculated formula | C18 H48 Cl4 Cu2 N8 O16 |
Title of publication | Inter- and intra-molecular pathways in polyamine synthesis from diamines † |
Authors of publication | Choi, Min-Ho; Kim, Bok Jo; Kim, Il-Chool; Kim, Seo-Hyang; Kim, Yang; Harrowfield, Jack M.; Lee, Man-Kil; Mocerino, Mauro; Rukmini, Elisabeth; Skelton, Brian W.; White, Allan H. |
Journal of publication | Journal of the Chemical Society, Dalton Transactions |
Year of publication | 2001 |
Journal issue | 5 |
Pages of publication | 707 |
a | 13.887 ± 0.001 Å |
b | 9.2532 ± 0.0009 Å |
c | 27.778 ± 0.003 Å |
α | 90° |
β | 90.634 ± 0.002° |
γ | 90° |
Cell volume | 3569.2 ± 0.6 Å3 |
Cell temperature | 293 K |
Ambient diffraction temperature | 293 K |
Number of distinct elements | 6 |
Space group number | 14 |
Hermann-Mauguin space group symbol | P 1 21/c 1 |
Hall space group symbol | -P 2ybc |
Residual factor for all reflections | 0.071 |
Residual factor for significantly intense reflections | 0.052 |
Weighted residual factors for all reflections | 0.072 |
Weighted residual factors for all reflections included in the refinement | 0.069 |
Goodness-of-fit parameter for all reflections | 2.004 |
Goodness-of-fit parameter for all reflections included in the refinement | 2.256 |
Diffraction radiation wavelength | 0.71073 Å |
Diffraction radiation type | MoKα |