Information card for entry 7010406
Formula | C12 H27 Cl4 Cu2 N5 O2 |
Calculated formula | C12 H27 Cl4 Cu2 N5 O2 |
Title of publication | Inter- and intra-molecular pathways in polyamine synthesis from diamines † |
Authors of publication | Choi, Min-Ho; Kim, Bok Jo; Kim, Il-Chool; Kim, Seo-Hyang; Kim, Yang; Harrowfield, Jack M.; Lee, Man-Kil; Mocerino, Mauro; Rukmini, Elisabeth; Skelton, Brian W.; White, Allan H. |
Journal of publication | Journal of the Chemical Society, Dalton Transactions |
Year of publication | 2001 |
Journal issue | 5 |
Pages of publication | 707 |
a | 17.439 ± 0.004 Å |
b | 8.0368 ± 0.0016 Å |
c | 15.946 ± 0.003 Å |
α | 90° |
β | 112.59 ± 0.03° |
γ | 90° |
Cell volume | 2063.4 ± 0.9 Å3 |
Cell temperature | 298 K |
Ambient diffraction temperature | 298 K |
Number of distinct elements | 6 |
Space group number | 9 |
Hermann-Mauguin space group symbol | C 1 c 1 |
Hall space group symbol | C -2yc |
Residual factor for all reflections | 0.0498 |
Residual factor for significantly intense reflections | 0.0394 |
Weighted residual factors for all reflections | 0.095 |
Weighted residual factors for all reflections included in the refinement | 0.103 |
Goodness-of-fit parameter for all reflections | 1.158 |
Goodness-of-fit parameter for all reflections included in the refinement | 1.159 |
Diffraction radiation wavelength | 0.71073 Å |
Diffraction radiation type | MoKα |