Information card for entry 7010419
Formula | C14 H30 Ag F6 N2 O4 P |
Calculated formula | C14 H30 Ag F6 N2 O4 P |
Title of publication | Macrocyclic ligand design. X-Ray, DFT and solution studies of the effect of N-methylation and N-benzylation of 1,4,10,13-tetraoxa-7,16-diazacyclooctadecane on its affinity for selected transition and post-transition metal ions |
Authors of publication | Hambley, Trevor W.; Lindoy, Leonard F.; Reimers, Jeffrey R.; Turner, Peter; Wei, Gang; Widmer-Cooper, Asaph N. |
Journal of publication | Journal of the Chemical Society, Dalton Transactions |
Year of publication | 2001 |
Journal issue | 5 |
Pages of publication | 614 |
a | 14.258 ± 0.002 Å |
b | 12.203 ± 0.001 Å |
c | 12.622 ± 0.001 Å |
α | 90° |
β | 98.895 ± 0.002° |
γ | 90° |
Cell volume | 2169.7 ± 0.4 Å3 |
Cell temperature | 273.2 K |
Ambient diffraction temperature | 294 ± 2 K |
Number of distinct elements | 7 |
Space group number | 14 |
Hermann-Mauguin space group symbol | P 1 21/c 1 |
Hall space group symbol | -P 2ybc |
Residual factor for all reflections | 0.0318 |
Residual factor for significantly intense reflections | 0.0318 |
Weighted residual factors for all reflections | 0.0259 |
Weighted residual factors for all reflections included in the refinement | 0.0259 |
Goodness-of-fit parameter for all reflections | 1.56 |
Goodness-of-fit parameter for all reflections included in the refinement | 1.56 |
Diffraction radiation wavelength | 0.71069 Å |
Diffraction radiation type | MoKα |