Information card for entry 7010510
Chemical name | 2-chloro-2-(triethylphosphino)-1,3,2-benzodioxaborole |
Formula | C12 H19 B Cl O2 P |
Calculated formula | C12 H19 B Cl O2 P |
SMILES | [B]1(Cl)(Oc2c(O1)cccc2)[P](CC)(CC)CC |
Title of publication | Phosphine promoted substituent redistribution reactions of B-chlorocatechol borane: molecular structures of ClBcat, BrBcat and L·ClBcat (cat = 1,2-O2C6H4; L = PMe3, PEt3, PBut3, PCy3, NEt3)† |
Authors of publication | Coapes, R. Benjamin; Souza, Fabio E. S.; Fox, Mark A.; Batsanov, Andrei S.; Goeta, Andrés E.; Yufit, Dimitrii S.; Leech, Michael A.; Howard, Judith A. K.; Scott, Andrew J.; Clegg, William; Marder, Todd B. |
Journal of publication | Journal of the Chemical Society, Dalton Transactions |
Year of publication | 2001 |
Journal issue | 8 |
Pages of publication | 1201 |
a | 13.4416 ± 0.0012 Å |
b | 14.0419 ± 0.0012 Å |
c | 14.604 ± 0.0014 Å |
α | 90° |
β | 90° |
γ | 90° |
Cell volume | 2756.4 ± 0.4 Å3 |
Cell temperature | 200 ± 2 K |
Ambient diffraction temperature | 200 ± 2 K |
Number of distinct elements | 6 |
Space group number | 61 |
Hermann-Mauguin space group symbol | P b c a |
Hall space group symbol | -P 2ac 2ab |
Residual factor for all reflections | 0.0462 |
Residual factor for significantly intense reflections | 0.0393 |
Weighted residual factors for significantly intense reflections | 0.0993 |
Weighted residual factors for all reflections included in the refinement | 0.1059 |
Goodness-of-fit parameter for all reflections included in the refinement | 1.074 |
Diffraction radiation wavelength | 0.71073 Å |
Diffraction radiation type | MoKα |