Information card for entry 7010524
Common name | 8 Rh6(CO)15(MeCN) |
Formula | C17 H3 N O15 Rh6 |
Calculated formula | C17 H3 N O15 Rh6 |
Title of publication | Ligand effects on the structures of Rh6(CO)15L clusters |
Authors of publication | Farrar, David H.; Grachova, Elena V.; Lough, Alan; Patirana, Charles; Poë, Anthony J.; Tunik, Sergey P. |
Journal of publication | Journal of the Chemical Society, Dalton Transactions |
Year of publication | 2001 |
Journal issue | 13 |
Pages of publication | 2015 |
a | 16.099 ± 0.004 Å |
b | 9.626 ± 0.001 Å |
c | 17.08 ± 0.003 Å |
α | 90° |
β | 104.39 ± 0.01° |
γ | 90° |
Cell volume | 2563.8 ± 0.8 Å3 |
Cell temperature | 173 ± 2 K |
Ambient diffraction temperature | 173 ± 2 K |
Number of distinct elements | 5 |
Space group number | 14 |
Hermann-Mauguin space group symbol | P 1 21/c 1 |
Hall space group symbol | -P 2ybc |
Residual factor for all reflections | 0.1555 |
Residual factor for significantly intense reflections | 0.0654 |
Weighted residual factors for all reflections | 0.1645 |
Weighted residual factors for all reflections included in the refinement | 0.1255 |
Goodness-of-fit parameter for all reflections | 1.01 |
Goodness-of-fit parameter for all reflections included in the refinement | 1.146 |
Diffraction radiation wavelength | 0.71073 Å |
Diffraction radiation type | MoKα |