Information card for entry 7010546
Formula | C25 H20 Au Cl3 N O2 P S |
Calculated formula | C25 H20 Au Cl3 N O2 P S |
SMILES | [Au](Sc1ccc(cc1)C(=O)O)[P](c1ccccc1)(c1ccccc1)c1ccccn1.C(Cl)(Cl)Cl |
Title of publication | Structural diversity in gold(I) complexes of 4-sulfanylbenzoic acid |
Authors of publication | Wilton-Ely, James D. E. T.; Schier, Annette; Mitzel, Norbert W.; Schmidbaur, Hubert |
Journal of publication | Journal of the Chemical Society, Dalton Transactions |
Year of publication | 2001 |
Journal issue | 7 |
Pages of publication | 1058 |
a | 8.3563 ± 0.0001 Å |
b | 17.482 ± 0.0003 Å |
c | 19.2 ± 0.0003 Å |
α | 104.53 ± 0.001° |
β | 90.423 ± 0.001° |
γ | 102.696 ± 0.001° |
Cell volume | 2642.92 ± 0.07 Å3 |
Cell temperature | 143 ± 2 K |
Ambient diffraction temperature | 143 ± 2 K |
Number of distinct elements | 8 |
Space group number | 2 |
Hermann-Mauguin space group symbol | P -1 |
Hall space group symbol | -P 1 |
Residual factor for all reflections | 0.0544 |
Residual factor for significantly intense reflections | 0.042 |
Weighted residual factors for significantly intense reflections | 0.0884 |
Weighted residual factors for all reflections included in the refinement | 0.0939 |
Goodness-of-fit parameter for all reflections included in the refinement | 1.032 |
Diffraction radiation wavelength | 0.71073 Å |
Diffraction radiation type | MoKα |