Information card for entry 7010638
Formula | C15 H23 Ag N4 O4 |
Calculated formula | C15 H23 Ag N4 O4 |
Title of publication | Syntheses and structures of three two-dimensional silver(I)‒hexamethylenetetramine co-ordination polymers with new topological motifs |
Authors of publication | Zheng, Shao-Liang; Tong, Ming-Liang; Zhu, Hai-Liang; Fang, Yue; Chen, Xiao-Ming |
Journal of publication | Journal of the Chemical Society, Dalton Transactions |
Year of publication | 2001 |
Journal issue | 13 |
Pages of publication | 2049 |
a | 12.219 ± 0.003 Å |
b | 10.842 ± 0.003 Å |
c | 13.006 ± 0.003 Å |
α | 90° |
β | 94.14 ± 0.01° |
γ | 90° |
Cell volume | 1718.5 ± 0.7 Å3 |
Cell temperature | 293 ± 2 K |
Ambient diffraction temperature | 293 ± 2 K |
Number of distinct elements | 5 |
Space group number | 14 |
Hermann-Mauguin space group symbol | P 1 21/c 1 |
Hall space group symbol | -P 2ybc |
Residual factor for all reflections | 0.04 |
Residual factor for significantly intense reflections | 0.0321 |
Weighted residual factors for significantly intense reflections | 0.0815 |
Weighted residual factors for all reflections included in the refinement | 0.0857 |
Goodness-of-fit parameter for all reflections included in the refinement | 1.056 |
Diffraction radiation wavelength | 0.71073 Å |
Diffraction radiation type | MoKα |