Information card for entry 7010669
Formula | C5 H24 B9 N3 |
Calculated formula | C5 H24 B9 N3 |
Title of publication | The synthesis of closo- and nido-(aminoalkyl)dicarbaboranes: a re-examination of contradictory literature reports, crystal structure of [7-{H3N(CH2)3}-7,8-C2B9H11]·NH2NH2† |
Authors of publication | Batsanov, Andrei S.; Goeta, Andrés E.; Howard, Judith A. K.; Hughes, Andrew K.; Malget, John M. |
Journal of publication | Journal of the Chemical Society, Dalton Transactions |
Year of publication | 2001 |
Journal issue | 12 |
Pages of publication | 1820 |
a | 10.707 ± 0.002 Å |
b | 12.477 ± 0.002 Å |
c | 20.805 ± 0.004 Å |
α | 90° |
β | 90° |
γ | 90° |
Cell volume | 2779.4 ± 0.9 Å3 |
Cell temperature | 120 ± 2 K |
Ambient diffraction temperature | 120 ± 2 K |
Number of distinct elements | 4 |
Space group number | 20 |
Hermann-Mauguin space group symbol | C 2 2 21 |
Hall space group symbol | C 2c 2 |
Residual factor for all reflections | 0.0546 |
Residual factor for significantly intense reflections | 0.0446 |
Weighted residual factors for significantly intense reflections | 0.1083 |
Weighted residual factors for all reflections included in the refinement | 0.1148 |
Goodness-of-fit parameter for all reflections included in the refinement | 1.078 |
Diffraction radiation wavelength | 0.71073 Å |
Diffraction radiation type | MoKα |