Information card for entry 7010706
Formula | C2 H10 Ga N |
Calculated formula | C2 H10 Ga N |
SMILES | [GaH3][NH](C)C |
Title of publication | Oligomeric structures of the crystalline dimethylamine adducts Me2(H)N·MH3 (M = Al or Ga) and the dimethylamido derivative [Me2NGaH2]3 |
Authors of publication | Tang, Christina Y.; Coxall, Robert A.; Downs, Anthony J.; Greene, Tim M.; Parsons, Simon |
Journal of publication | Journal of the Chemical Society, Dalton Transactions |
Year of publication | 2001 |
Journal issue | 14 |
Pages of publication | 2141 |
a | 17.146 ± 0.002 Å |
b | 6.3918 ± 0.0012 Å |
c | 10.4809 ± 0.0015 Å |
α | 90° |
β | 102.835 ± 0.011° |
γ | 90° |
Cell volume | 1119.9 ± 0.3 Å3 |
Cell temperature | 230 ± 2 K |
Ambient diffraction temperature | 230 ± 2 K |
Number of distinct elements | 4 |
Space group number | 15 |
Hermann-Mauguin space group symbol | C 1 2/c 1 |
Hall space group symbol | -C 2yc |
Residual factor for all reflections | 0.1151 |
Residual factor for significantly intense reflections | 0.0423 |
Weighted residual factors for significantly intense reflections | 0.0624 |
Weighted residual factors for all reflections included in the refinement | 0.0766 |
Goodness-of-fit parameter for all reflections included in the refinement | 0.951 |
Diffraction radiation wavelength | 0.71073 Å |
Diffraction radiation type | MoKα |