Information card for entry 7010708
Common name | Cd(N,N'-meen)2(2,6nds) |
Chemical name | bis(N,N'-dimethylethylenediamine)-cadmium(II) naphthalene-2,6-disulfonate |
Formula | C18 H30 Cd N4 O6 S2 |
Calculated formula | C18 H30 Cd N4 O6 S2 |
Title of publication | A novel supramolecular synthon for H-bonded coordination networks: syntheses and structures of extended 2-dimensional cadmium(II) arenedisulfonates |
Authors of publication | Cai, Jiwen; Chen, Cai-Hong; Feng, Xiao-Long; Liao, Cheng-Zhu; Chen, Xiao-Ming |
Journal of publication | Journal of the Chemical Society, Dalton Transactions |
Year of publication | 2001 |
Journal issue | 16 |
Pages of publication | 2370 |
a | 7.6548 ± 0.0012 Å |
b | 11.9968 ± 0.0018 Å |
c | 12.832 ± 0.002 Å |
α | 90° |
β | 103.836 ± 0.003° |
γ | 90° |
Cell volume | 1144.2 ± 0.3 Å3 |
Cell temperature | 293 ± 2 K |
Ambient diffraction temperature | 293 ± 2 K |
Number of distinct elements | 6 |
Space group number | 14 |
Hermann-Mauguin space group symbol | P 1 21/c 1 |
Hall space group symbol | -P 2ybc |
Residual factor for all reflections | 0.0328 |
Residual factor for significantly intense reflections | 0.0255 |
Weighted residual factors for significantly intense reflections | 0.071 |
Weighted residual factors for all reflections included in the refinement | 0.074 |
Goodness-of-fit parameter for all reflections included in the refinement | 1.07 |
Diffraction radiation wavelength | 0.71073 Å |
Diffraction radiation type | MoKα |