Information card for entry 7010800
Formula | C16 H36 N8 P2 Pd |
Calculated formula | C16 H36 N8 P2 Pd |
SMILES | C[P](C)([Pd](c1n(nnn1)CCCC)(c1n(CCCC)nnn1)[P](C)(C)C)C |
Title of publication | Reactions of palladium(II) and platinum(II) bis(azido) complexes with isocyanides: synthesis and structural characterization of palladium(II) and platinum(II) complexes containing carbodiimido (or bis(carbodiimido)) and bis(tetrazolato) ligands |
Authors of publication | Yong-Joo Kim; Yong-Su Kwak; Young-Seon Joo; Soon-W. Lee |
Journal of publication | J. Chem. Soc., Dalton Trans. |
Year of publication | 2002 |
Journal issue | 2 |
Pages of publication | 144 - 151 |
a | 6.3758 ± 0.0008 Å |
b | 15.6567 ± 0.0013 Å |
c | 12.6709 ± 0.0015 Å |
α | 90° |
β | 92.422 ± 0.009° |
γ | 90° |
Cell volume | 1263.7 ± 0.2 Å3 |
Cell temperature | 294 ± 2 K |
Ambient diffraction temperature | 294 ± 2 K |
Number of distinct elements | 5 |
Space group number | 14 |
Hermann-Mauguin space group symbol | P 1 21/n 1 |
Hall space group symbol | -P 2yn |
Residual factor for all reflections | 0.0308 |
Residual factor for significantly intense reflections | 0.0282 |
Weighted residual factors for significantly intense reflections | 0.076 |
Weighted residual factors for all reflections included in the refinement | 0.0784 |
Goodness-of-fit parameter for all reflections included in the refinement | 1.015 |
Diffraction radiation wavelength | 0.71073 Å |
Diffraction radiation type | MoKα |