Information card for entry 7010837
Common name | rs0024 |
Formula | C19 H33 Al Li N3 Si2 |
Calculated formula | C19 H33 Al Li N3 Si2 |
Title of publication | The crystallographic observation of molecular lithium oxide: synthesis and solid-state structure of [Me2AlN(2-C5H4N)Ph]2(O)Li2·2THF† |
Authors of publication | Armstrong, David R.; Davies, Robert P.; Linton, David J.; Snaith, Ronald; Schooler, Paul; Wheatley, Andrew E. H. |
Journal of publication | Journal of the Chemical Society, Dalton Transactions |
Year of publication | 2001 |
Journal issue | 19 |
Pages of publication | 2838 |
a | 13.814 ± 0.0004 Å |
b | 17.674 ± 0.0005 Å |
c | 19.75 ± 0.0005 Å |
α | 90° |
β | 99.557 ± 0.0018° |
γ | 90° |
Cell volume | 4755 ± 0.2 Å3 |
Cell temperature | 180 ± 2 K |
Ambient diffraction temperature | 180 ± 2 K |
Number of distinct elements | 6 |
Space group number | 14 |
Hermann-Mauguin space group symbol | P 1 21/n 1 |
Hall space group symbol | -P 2yn |
Residual factor for all reflections | 0.0792 |
Residual factor for significantly intense reflections | 0.0543 |
Weighted residual factors for significantly intense reflections | 0.148 |
Weighted residual factors for all reflections included in the refinement | 0.1662 |
Goodness-of-fit parameter for all reflections included in the refinement | 1.063 |
Diffraction radiation wavelength | 0.7107 Å |
Diffraction radiation type | MoKα |