Information card for entry 7012004
Formula | C32 H56 Al2 Co O12 |
Calculated formula | C32 H56 Al2 Co O12 |
SMILES | C([O]1[Al]234(OC(=CC(=[O]4)C)C)(OC(=CC(=[O]3)C)C)[Co]31([O](C(C)C)[Al]14([O]3C(C)C)([O]=C(C=C(O4)C)C)[O]=C(C=C(O1)C)C)[O]2C(C)C)(C)C |
Title of publication | Interaction of some divalent metal acetylacetonates with Al, Ti, Nb and Ta isopropoxides. Factors influencing the formation and stability of heterometallic alkoxide complexesElectronic supplementary information (ESI) available: synthesis details for 5‒7; microanalysis data for 1‒9; tables of selected bond lengths and angles for 1‒5 and 7‒9; variable temperature 1H NMR spectra for 7 and 8; UV-Vis spectrum of 6 in toluene after various times. See http://www.rsc.org/suppdata/dt/b2/b206662a/ |
Authors of publication | Kessler, Vadim G.; Gohil, Suresh; Parola, Stephane |
Journal of publication | Dalton Transactions |
Year of publication | 2003 |
Journal issue | 4 |
Pages of publication | 544 |
a | 17.451 ± 0.009 Å |
b | 15.407 ± 0.009 Å |
c | 14.656 ± 0.008 Å |
α | 90° |
β | 90.288 ± 0.017° |
γ | 90° |
Cell volume | 3940 ± 4 Å3 |
Cell temperature | 295 ± 2 K |
Ambient diffraction temperature | 295 ± 2 K |
Number of distinct elements | 5 |
Space group number | 15 |
Hermann-Mauguin space group symbol | C 1 2/c 1 |
Hall space group symbol | -C 2yc |
Residual factor for all reflections | 0.0955 |
Residual factor for significantly intense reflections | 0.0482 |
Weighted residual factors for significantly intense reflections | 0.1121 |
Weighted residual factors for all reflections included in the refinement | 0.1254 |
Goodness-of-fit parameter for all reflections included in the refinement | 0.925 |
Diffraction radiation wavelength | 0.71073 Å |
Diffraction radiation type | MoKα |