Information card for entry 7012211
Formula | C14 H19 Cl3 Cu N4 O6.5 |
Calculated formula | C14 H19 Cl3 Cu N4 O6.5 |
Title of publication | Syntheses and characterization of copper complexes of the ligand (2-aminoethyl)bis(2-pyridylmethyl)amine (uns-penp) and derivatives |
Authors of publication | Schatz, Markus; Leibold, Michael; Foxon, Simon P.; Weitzer, Markus; Heinemann, Frank W.; Hampel, Frank; Walter, Olaf; Schindler, Siegfried |
Journal of publication | Dalton Transactions |
Year of publication | 2003 |
Journal issue | 8 |
Pages of publication | 1480 |
a | 14.3876 ± 0.0013 Å |
b | 20.6906 ± 0.0018 Å |
c | 14.8827 ± 0.0013 Å |
α | 90° |
β | 108.828 ± 0.001° |
γ | 90° |
Cell volume | 4193.3 ± 0.6 Å3 |
Cell temperature | 200 ± 2 K |
Ambient diffraction temperature | 200 ± 2 K |
Number of distinct elements | 6 |
Space group number | 15 |
Hermann-Mauguin space group symbol | C 1 2/c 1 |
Hall space group symbol | -C 2yc |
Residual factor for all reflections | 0.0686 |
Residual factor for significantly intense reflections | 0.0508 |
Weighted residual factors for significantly intense reflections | 0.1713 |
Weighted residual factors for all reflections included in the refinement | 0.1802 |
Goodness-of-fit parameter for all reflections included in the refinement | 1.057 |
Diffraction radiation wavelength | 0.71073 Å |
Diffraction radiation type | MoKα |