Information card for entry 7012525
Formula |
C35 H54 Cl0 Ge N2 Se |
Calculated formula |
C32.508 H48.893 Cl0.123 Ge N2 Se |
Title of publication |
Syntheses, structures and properties of [{HC(CMeNAr)2}Ge(E)X] (Ar = 2,6-iPr2C6H3; E = S, Se; X = F, Cl) |
Authors of publication |
Ding, Yuqiang; Ma, Qingjun; Roesky, Herbert W.; Usón, Isabel; Noltemeyer, Mathias; Schmidt, Hans-Georg |
Journal of publication |
Dalton Transactions |
Year of publication |
2003 |
Journal issue |
6 |
Pages of publication |
1094 |
a |
16.714 ± 0.003 Å |
b |
10.213 ± 0.002 Å |
c |
18.801 ± 0.004 Å |
α |
90° |
β |
99 ± 0.03° |
γ |
90° |
Cell volume |
3169.8 ± 1.1 Å3 |
Cell temperature |
200 ± 2 K |
Ambient diffraction temperature |
200 ± 2 K |
Number of distinct elements |
6 |
Space group number |
14 |
Hermann-Mauguin space group symbol |
P 1 21/n 1 |
Hall space group symbol |
-P 2yn |
Residual factor for all reflections |
0.0523 |
Residual factor for significantly intense reflections |
0.043 |
Weighted residual factors for significantly intense reflections |
0.1029 |
Weighted residual factors for all reflections included in the refinement |
0.1091 |
Goodness-of-fit parameter for all reflections included in the refinement |
1.11 |
Diffraction radiation wavelength |
0.71073 Å |
Diffraction radiation type |
MoKα |
Yes |
Yes |
No |