Information card for entry 7012598
Formula | C42 H48 N9 P3 |
Calculated formula | C42 H48 N9 P3 |
Title of publication | Supramolecular variations on a molecular theme: the structural diversity of phosphazenes (RNH)6P3N3 in the solid state |
Authors of publication | Bickley, Jamie F.; Bonar-Law, Richard; Lawson, Gavin T.; Richards, Philip I.; Rivals, Frederic; Steiner, Alexander; Zacchini, Stefano |
Journal of publication | Dalton Transactions |
Year of publication | 2003 |
Journal issue | 7 |
Pages of publication | 1235 |
a | 11.627 ± 0.003 Å |
b | 24.689 ± 0.003 Å |
c | 15.391 ± 0.002 Å |
α | 90° |
β | 111.95 ± 0.01° |
γ | 90° |
Cell volume | 4097.9 ± 1.3 Å3 |
Cell temperature | 123 ± 2 K |
Ambient diffraction temperature | 150 ± 2 K |
Number of distinct elements | 4 |
Space group number | 4 |
Hermann-Mauguin space group symbol | P 1 21 1 |
Hall space group symbol | P 2yb |
Residual factor for all reflections | 0.0594 |
Residual factor for significantly intense reflections | 0.0372 |
Weighted residual factors for significantly intense reflections | 0.0769 |
Weighted residual factors for all reflections included in the refinement | 0.0824 |
Goodness-of-fit parameter for all reflections included in the refinement | 0.852 |
Diffraction radiation wavelength | 0.71073 Å |
Diffraction radiation type | MoKα |