Information card for entry 7012603
Formula | C18 H48 N9 P3 |
Calculated formula | C18 H48 N9 P3 |
Title of publication | Supramolecular variations on a molecular theme: the structural diversity of phosphazenes (RNH)6P3N3 in the solid state |
Authors of publication | Bickley, Jamie F.; Bonar-Law, Richard; Lawson, Gavin T.; Richards, Philip I.; Rivals, Frederic; Steiner, Alexander; Zacchini, Stefano |
Journal of publication | Dalton Transactions |
Year of publication | 2003 |
Journal issue | 7 |
Pages of publication | 1235 |
a | 42.21 ± 0.005 Å |
b | 11.3419 ± 0.0012 Å |
c | 23.092 ± 0.003 Å |
α | 90° |
β | 91.105 ± 0.002° |
γ | 90° |
Cell volume | 11053 ± 2 Å3 |
Cell temperature | 150 ± 2 K |
Ambient diffraction temperature | 150 ± 2 K |
Number of distinct elements | 4 |
Space group number | 15 |
Hermann-Mauguin space group symbol | C 1 2/c 1 |
Hall space group symbol | -C 2yc |
Residual factor for all reflections | 0.1002 |
Residual factor for significantly intense reflections | 0.0621 |
Weighted residual factors for significantly intense reflections | 0.1804 |
Weighted residual factors for all reflections included in the refinement | 0.2038 |
Goodness-of-fit parameter for all reflections included in the refinement | 1.029 |
Diffraction radiation wavelength | 0.71073 Å |
Diffraction radiation type | MoKα |