Information card for entry 7012667
Formula | C70 H71 N4 O2 Si2 Ta |
Calculated formula | C70 H71 N4 O2 Si2 Ta |
Title of publication | The isolation and chemistry of tantalum dimethylamides containing resolved 3,3'-disubstituted-1,1'-bi-2,2'-naphthoxide ligandsElectronic supplementary information (ESI) available: ORTEP views of (R)-7, (R,S)-8, (S)-9 and (S)-12. See http://www.rsc.org/suppdata/dt/b2/b212910h/ |
Authors of publication | Ru Son, Au Ji; Schweiger, Scott W.; Thorn, Matthew G.; Moses, John E.; Fanwick, Phillip E.; Rothwell, Ian P. |
Journal of publication | Dalton Transactions |
Year of publication | 2003 |
Journal issue | 8 |
Pages of publication | 1620 |
a | 11.6987 ± 0.0002 Å |
b | 18.2575 ± 0.0004 Å |
c | 28.1025 ± 0.0005 Å |
α | 90° |
β | 94.7591 ± 0.0012° |
γ | 90° |
Cell volume | 5981.7 ± 0.2 Å3 |
Cell temperature | 173 K |
Ambient diffraction temperature | 173 K |
Number of distinct elements | 6 |
Space group number | 14 |
Hermann-Mauguin space group symbol | P 1 21/c 1 |
Hall space group symbol | -P 2ybc |
Residual factor for significantly intense reflections | 0.048 |
Weighted residual factors for all reflections included in the refinement | 0.077 |
Goodness-of-fit parameter for all reflections included in the refinement | 1.016 |
Diffraction radiation wavelength | 0.71073 Å |
Diffraction radiation type | MO-Kα |