Information card for entry 7012700
Formula | C30.5 H17 Cl F9 N3 O6 S3 Yb |
Calculated formula | C30.5 H17 Cl F9 N3 O6 S3 Yb |
Title of publication | Visible-light sensitisation of near-infrared luminescence from Yb(iii), Nd(iii) and Er(iii) complexes of 3,6-bis(2-pyridyl)tetrazine |
Authors of publication | Shavaleev, Nail M.; Pope, Simon J. A.; Bell, Zöe R.; Faulkner, Stephen; Ward, Michael D. |
Journal of publication | Dalton Transactions |
Year of publication | 2003 |
Journal issue | 5 |
Pages of publication | 808 |
a | 10.335 ± 0.007 Å |
b | 19.431 ± 0.01 Å |
c | 19.085 ± 0.011 Å |
α | 90° |
β | 105.22 ± 0.07° |
γ | 90° |
Cell volume | 3698 ± 4 Å3 |
Cell temperature | 173 ± 2 K |
Ambient diffraction temperature | 173 ± 2 K |
Number of distinct elements | 8 |
Space group number | 14 |
Hermann-Mauguin space group symbol | P 1 21/c 1 |
Hall space group symbol | -P 2ybc |
Residual factor for all reflections | 0.1728 |
Residual factor for significantly intense reflections | 0.0705 |
Weighted residual factors for significantly intense reflections | 0.1495 |
Weighted residual factors for all reflections included in the refinement | 0.1932 |
Goodness-of-fit parameter for all reflections included in the refinement | 0.946 |
Diffraction radiation wavelength | 0.71073 Å |
Diffraction radiation type | MoKα |