Information card for entry 7012710
Formula | C34 H35 Cl Mo O3 P2 |
Calculated formula | C34 H35 Cl Mo O3 P2 |
SMILES | [Mo]123([P](c4ccccc4)(C[P]1(c1ccccc1)c1ccccc1)c1ccccc1)(Cl)(C#[O])(C#[O])[CH](=[CH2]2)C3.O1CCCC1 |
Title of publication | Reactivity of the labile complex [MoCl(η3-allyl)(CO)2(NCMe)2] with diphosphanes |
Authors of publication | Pérez, Julio; Morales, Dolores; Riera, Víctor; Rodríguez, Amor; García-Granda, Santiago |
Journal of publication | Dalton Transactions |
Year of publication | 2003 |
Journal issue | 8 |
Pages of publication | 1641 |
a | 15.119 ± 0.005 Å |
b | 10.83 ± 0.005 Å |
c | 23.494 ± 0.005 Å |
α | 90° |
β | 123.229 ± 0.005° |
γ | 90° |
Cell volume | 3218 ± 2 Å3 |
Cell temperature | 293 ± 2 K |
Ambient diffraction temperature | 293 ± 2 K |
Number of distinct elements | 6 |
Space group number | 14 |
Hermann-Mauguin space group symbol | P 1 21/c 1 |
Hall space group symbol | -P 2ybc |
Residual factor for all reflections | 0.0482 |
Residual factor for significantly intense reflections | 0.0365 |
Weighted residual factors for significantly intense reflections | 0.0863 |
Weighted residual factors for all reflections included in the refinement | 0.0923 |
Goodness-of-fit parameter for all reflections included in the refinement | 1.038 |
Diffraction radiation wavelength | 1.5418 Å |
Diffraction radiation type | CuKα |