Information card for entry 7012716
Formula | C24 H24 Cl Cu N6 O4 |
Calculated formula | C24 H24 Cl Cu N6 O4 |
Title of publication | Syntheses, structures and photoluminescent properties of cadmium(ii), silver(i) and copper(i) complexes with novel long chain tetradentate ligands |
Authors of publication | Ouyang, Xing-Mei; Liu, De-Jun; Okamura, Taka-aki; Bu, Hong-Wei; Sun, Wei-Yin; Tang, Wen-Xia; Ueyama, Norikazu |
Journal of publication | Dalton Transactions |
Year of publication | 2003 |
Journal issue | 9 |
Pages of publication | 1836 |
a | 13.718 ± 0.0007 Å |
b | 10.1127 ± 0.0007 Å |
c | 19.0653 ± 0.001 Å |
α | 90° |
β | 108.971 ± 0.003° |
γ | 90° |
Cell volume | 2501.2 ± 0.3 Å3 |
Cell temperature | 200 K |
Ambient diffraction temperature | 200 K |
Number of distinct elements | 6 |
Space group number | 14 |
Hermann-Mauguin space group symbol | P 1 21/c 1 |
Hall space group symbol | -P 2ybc |
Residual factor for all reflections | 0.1501 |
Residual factor for significantly intense reflections | 0.0419 |
Weighted residual factors for significantly intense reflections | 0.0606 |
Weighted residual factors for all reflections included in the refinement | 0.0709 |
Goodness-of-fit parameter for all reflections included in the refinement | 0.67 |
Diffraction radiation wavelength | 0.71069 Å |
Diffraction radiation type | MoKα |