Information card for entry 7012786
Formula | C17 H19 N9 O10.5 Pr |
Calculated formula | C17 H16 N9 O10.5 Pr |
Title of publication | The coordination chemistry of 1,2,4-triazinyl bipyridines with lanthanide(III) elements ‒ implications for the partitioning of americium(III) |
Authors of publication | Michael J. Hudson; Michael G. B. Drew; Mark R. StJ. Foreman; Clément Hill; Nathalie Huet; Charles Madic; Tristan G. A. Youngs |
Journal of publication | Dalton Trans. |
Year of publication | 2003 |
Journal issue | 9 |
Pages of publication | 1675 - 1685 |
a | 9.248 ± 0.016 Å |
b | 12.976 ± 0.018 Å |
c | 12.967 ± 0.015 Å |
α | 60.461 ± 0.01° |
β | 85.997 ± 0.01° |
γ | 89.33 ± 0.01° |
Cell volume | 1350 ± 3 Å3 |
Cell temperature | 293 ± 2 K |
Ambient diffraction temperature | 293 ± 2 K |
Number of distinct elements | 5 |
Space group number | 2 |
Hermann-Mauguin space group symbol | P -1 |
Hall space group symbol | -P 1 |
Residual factor for all reflections | 0.1173 |
Residual factor for significantly intense reflections | 0.1015 |
Weighted residual factors for significantly intense reflections | 0.2605 |
Weighted residual factors for all reflections included in the refinement | 0.2727 |
Goodness-of-fit parameter for all reflections included in the refinement | 1.102 |
Diffraction radiation wavelength | 0.71073 Å |
Diffraction radiation type | MoKα |