Information card for entry 7012838
Formula | C16 H41 N14 O14.5 Pd2 Pt |
Calculated formula | C16 H36 N14 O14.5 Pd2 Pt |
Title of publication | Inter- and intra-molecular condensation patterns of (en)PdII with trans-[a2PtL2]2+ (a = am(m)ine, L = 2-aminopyridine): PtPd3 and Pt2Pd4 species with multiple amide bridges. Unexpected trapping of a pair of nitrate ions by a Pt2Pd4 double coneElectronic supplementary information (ESI) available: 1H NMR spectra of 2a, 4a and 5; views of the crystal structure of 5. See http://www.rsc.org/suppdata/dt/b3/b301708g/ |
Authors of publication | Beck, Bettina; Schneider, Alexandra; Freisinger, Eva; Holthenrich, Dagmar; Erxleben, Andrea; Albinati, Alberto; Zangrando, Ennio; Randaccio, Lucio; Lippert, Bernhard |
Journal of publication | Dalton Transactions |
Year of publication | 2003 |
Journal issue | 12 |
Pages of publication | 2533 |
a | 11.447 ± 0.002 Å |
b | 13.201 ± 0.003 Å |
c | 13.673 ± 0.003 Å |
α | 108.51 ± 0.03° |
β | 103.75 ± 0.03° |
γ | 110.5 ± 0.03° |
Cell volume | 1687.7 ± 1.1 Å3 |
Cell temperature | 293 ± 2 K |
Ambient diffraction temperature | 293 ± 2 K |
Number of distinct elements | 6 |
Space group number | 2 |
Hermann-Mauguin space group symbol | P -1 |
Hall space group symbol | -P 1 |
Residual factor for all reflections | 0.0498 |
Residual factor for significantly intense reflections | 0.0323 |
Weighted residual factors for all reflections | 0.0733 |
Weighted residual factors for significantly intense reflections | 0.0695 |
Goodness-of-fit parameter for all reflections | 0.937 |
Goodness-of-fit parameter for significantly intense reflections | 1.048 |
Diffraction radiation wavelength | 0.71069 Å |
Diffraction radiation type | MoKα |