Information card for entry 7012900
Formula | C37 H44 F6 N6 O2.5 P Rh |
Calculated formula | C37 H40 F6 N6 O2.5 P Rh |
Title of publication | The substitution chemistry of the tris(3,5-dimethylpyrazolyl)methanerhodium complex [Rh(CO)2{HC(pz?)3}]+ |
Authors of publication | Adams, Christopher J.; Connelly, Neil G.; Emslie, David J. H.; Hayward, Owen D.; Manson, Tania; Guy Orpen, A.; Rieger, Philip H. |
Journal of publication | Dalton Transactions |
Year of publication | 2003 |
Journal issue | 14 |
Pages of publication | 2835 |
a | 18.231 ± 0.006 Å |
b | 10.71 ± 0.003 Å |
c | 19.5 ± 0.005 Å |
α | 90 ± 0.02° |
β | 93.4 ± 0.03° |
γ | 90 ± 0.03° |
Cell volume | 3800.8 ± 1.9 Å3 |
Cell temperature | 173 ± 2 K |
Ambient diffraction temperature | 173 ± 2 K |
Number of distinct elements | 7 |
Space group number | 13 |
Hermann-Mauguin space group symbol | P 1 2/n 1 |
Hall space group symbol | -P 2yac |
Residual factor for all reflections | 0.1646 |
Residual factor for significantly intense reflections | 0.075 |
Weighted residual factors for significantly intense reflections | 0.1673 |
Weighted residual factors for all reflections included in the refinement | 0.2049 |
Goodness-of-fit parameter for all reflections included in the refinement | 0.986 |
Diffraction radiation wavelength | 0.71073 Å |
Diffraction radiation type | MoKα |