Information card for entry 7012972
Formula | C52 H30 Au2 O15 P2 Pt Ru5 |
Calculated formula | C52 H30 Au2 O15 P2 Pt Ru5 |
Title of publication | The synthesis and characterisation of the cluster dianion [PtRu5C(CO)15]2? and its reactions with Au and Pt cationic fragments produced in situ |
Authors of publication | Khimyak, Tetyana; Johnson, Brian F. G.; Hermans, Sophie; Bond, Andrew D. |
Journal of publication | Dalton Transactions |
Year of publication | 2003 |
Journal issue | 13 |
Pages of publication | 2651 |
a | 32.9658 ± 0.0007 Å |
b | 12.5706 ± 0.0002 Å |
c | 30.1546 ± 0.0006 Å |
α | 90° |
β | 115.229 ± 0.001° |
γ | 90° |
Cell volume | 11304.1 ± 0.4 Å3 |
Cell temperature | 180 ± 2 K |
Ambient diffraction temperature | 180 ± 2 K |
Number of distinct elements | 7 |
Space group number | 15 |
Hermann-Mauguin space group symbol | C 1 2/c 1 |
Hall space group symbol | -C 2yc |
Residual factor for all reflections | 0.1064 |
Residual factor for significantly intense reflections | 0.0779 |
Weighted residual factors for significantly intense reflections | 0.1889 |
Weighted residual factors for all reflections included in the refinement | 0.2088 |
Goodness-of-fit parameter for all reflections included in the refinement | 1.008 |
Diffraction radiation wavelength | 0.7107 Å |
Diffraction radiation type | MoKα |