Information card for entry 7012986
Formula | C15 H16 Au N O5 |
Calculated formula | C15 H16 Au N O5 |
SMILES | [Au]1(c2ccccc2c2[n]1cccc2)(OC(=O)C)OC(=O)C.O |
Title of publication | Chemical and biological studies of the dichloro(2-phenylpyridine) gold(iii) complex and its derivatives |
Authors of publication | Fan, Daming; Yang, Chang-Tong; Ranford, John D.; Lee, Peng Foo; Vittal, Jagadese J. |
Journal of publication | Dalton Transactions |
Year of publication | 2003 |
Journal issue | 13 |
Pages of publication | 2680 |
a | 8.9815 ± 0.0001 Å |
b | 9.5238 ± 0.0002 Å |
c | 11.1538 ± 0.0002 Å |
α | 65.668 ± 0.001° |
β | 70.962 ± 0.001° |
γ | 64.721 ± 0.001° |
Cell volume | 772.9 ± 0.02 Å3 |
Cell temperature | 293 ± 2 K |
Ambient diffraction temperature | 293 ± 2 K |
Number of distinct elements | 5 |
Space group number | 2 |
Hermann-Mauguin space group symbol | P -1 |
Hall space group symbol | -P 1 |
Residual factor for all reflections | 0.052 |
Residual factor for significantly intense reflections | 0.0476 |
Weighted residual factors for all reflections | 0.124 |
Weighted residual factors for significantly intense reflections | 0.1205 |
Goodness-of-fit parameter for all reflections | 1.025 |
Goodness-of-fit parameter for significantly intense reflections | 1.05 |
Diffraction radiation wavelength | 0.71073 Å |
Diffraction radiation type | MoKα |