Information card for entry 7013184
Formula | C12 H28 N8 P2 Pt S2 |
Calculated formula | C12 H28 N8 P2 Pt S2 |
SMILES | c1(n(CC)nnn1)S[Pt]([P](C)(C)C)([P](C)(C)C)Sc1nnnn1CC |
Title of publication | Reactivity of di(azido)bis(phosphine) complexes of Ni(ii), Pd(ii) and Pt(ii) toward organic isothiocyanates: synthesis, structures, and properties of bis(tetrazole-thiolato) and bis(isothiocyanato) complexes |
Authors of publication | Kim, Yong-Joo; Han, Jin-Taek; Kang, Seok; Han, Won Seok; Lee, Soon W. |
Journal of publication | Dalton Transactions |
Year of publication | 2003 |
Journal issue | 17 |
Pages of publication | 3357 |
a | 11.367 ± 0.002 Å |
b | 8.5306 ± 0.0011 Å |
c | 11.5869 ± 0.0015 Å |
α | 90° |
β | 93.634 ± 0.012° |
γ | 90° |
Cell volume | 1121.3 ± 0.3 Å3 |
Cell temperature | 293 ± 2 K |
Ambient diffraction temperature | 293 ± 2 K |
Number of distinct elements | 6 |
Space group number | 14 |
Hermann-Mauguin space group symbol | P 1 21/c 1 |
Hall space group symbol | -P 2ybc |
Residual factor for all reflections | 0.0361 |
Residual factor for significantly intense reflections | 0.0242 |
Weighted residual factors for significantly intense reflections | 0.055 |
Weighted residual factors for all reflections included in the refinement | 0.06 |
Goodness-of-fit parameter for all reflections included in the refinement | 1.073 |
Diffraction radiation wavelength | 0.71073 Å |
Diffraction radiation type | MoKα |