Information card for entry 7013190
Formula | C46 H36 N6 Pt |
Calculated formula | C46 H26 N6 Pt |
Title of publication | Platinum(ii) diimine complexes of acetylides containing 7-azaindolyl and 2,2?-dipyridylamino functional groupsElectronic supplementary information (ESI) available: emission spectra of 1?4 in the solid state at 298 and 77 K; structures and packing diagrams of 1 and 4. See http://www.rsc.org/suppdata/dt/b3/b305408j/ |
Authors of publication | Kang, Youngjin; Lee, Junghyun; Song, Datong; Wang, Suning |
Journal of publication | Dalton Transactions |
Year of publication | 2003 |
Journal issue | 18 |
Pages of publication | 3493 |
a | 6.6498 ± 0.0012 Å |
b | 16.203 ± 0.003 Å |
c | 17.395 ± 0.004 Å |
α | 88.544 ± 0.003° |
β | 83.276 ± 0.004° |
γ | 83.331 ± 0.004° |
Cell volume | 1848.6 ± 0.6 Å3 |
Cell temperature | 571 ± 2 K |
Ambient diffraction temperature | 571 ± 2 K |
Number of distinct elements | 4 |
Space group number | 2 |
Hermann-Mauguin space group symbol | P -1 |
Hall space group symbol | -P 1 |
Residual factor for all reflections | 0.1488 |
Residual factor for significantly intense reflections | 0.0489 |
Weighted residual factors for significantly intense reflections | 0.0729 |
Weighted residual factors for all reflections included in the refinement | 0.0862 |
Goodness-of-fit parameter for all reflections included in the refinement | 0.695 |
Diffraction radiation wavelength | 0.71073 Å |
Diffraction radiation type | MoKα |