Information card for entry 7013222
Common name | bis(aminal) |
Formula | C29 H36 N4 |
Calculated formula | C29 H36 N4 |
Title of publication | Synthesis, structural studies and photochemistry of cobalt(iii) complexes of anthracenylcyclam macrocyclesElectronic supplementary information (ESI) available: Selected bond lengths and angles and ORTEP diagrams for compound 8 and complexes [Co(3)Cl2]Cl�4H2O, [Co(12)Cl2] and [Co(2)Cl2]Cl�0.5CH3OH. See http://www.rsc.org/suppdata/dt/b3/b305773a/ |
Authors of publication | Funston, Alison M.; Ghiggino, Kenneth P.; Grannas, Martin J.; David McFadyen, W.; Tregloan, Peter A. |
Journal of publication | Dalton Transactions |
Year of publication | 2003 |
Journal issue | 19 |
Pages of publication | 3704 |
a | 9.9553 ± 0.0006 Å |
b | 11.6873 ± 0.0005 Å |
c | 12.1534 ± 0.0005 Å |
α | 115.186 ± 0.004° |
β | 96.967 ± 0.004° |
γ | 107.303 ± 0.005° |
Cell volume | 1170.36 ± 0.12 Å3 |
Cell temperature | 291 ± 2 K |
Ambient diffraction temperature | 291 ± 2 K |
Number of distinct elements | 3 |
Space group number | 2 |
Hermann-Mauguin space group symbol | P -1 |
Hall space group symbol | -P 1 |
Residual factor for all reflections | 0.055 |
Residual factor for significantly intense reflections | 0.0443 |
Weighted residual factors for significantly intense reflections | 0.1174 |
Weighted residual factors for all reflections included in the refinement | 0.1263 |
Goodness-of-fit parameter for all reflections included in the refinement | 1.052 |
Diffraction radiation wavelength | 1.5418 Å |
Diffraction radiation type | CuKα |