Information card for entry 7014369
Formula | C75 H105 Au4 F24 N8 O4 P6 S4 |
Calculated formula | C75 H105 Au4 F24 N8 O4 P6 S4 |
Title of publication | Reactions of a gold(I) thiolate complex [Au(Tab)(2)](2)(PF(6))(2) (Tab = 4-(trimethylammonio)benzenethiolate) with diphosphine ligands. |
Authors of publication | Zheng, Ai-Xia; Ren, Zhi-Gang; Li, Ling-Ling; Shang, Hai; Li, Hong-Xi; Lang, Jian-Ping |
Journal of publication | Dalton transactions (Cambridge, England : 2003) |
Year of publication | 2011 |
Journal volume | 40 |
Journal issue | 3 |
Pages of publication | 589 - 596 |
a | 14.778 ± 0.003 Å |
b | 37.26 ± 0.008 Å |
c | 8.9963 ± 0.0018 Å |
α | 90° |
β | 100.35 ± 0.03° |
γ | 90° |
Cell volume | 4873 ± 1.8 Å3 |
Cell temperature | 223 ± 2 K |
Ambient diffraction temperature | 223 ± 2 K |
Number of distinct elements | 8 |
Space group number | 14 |
Hermann-Mauguin space group symbol | P 1 21/c 1 |
Hall space group symbol | -P 2ybc |
Residual factor for all reflections | 0.1086 |
Residual factor for significantly intense reflections | 0.0795 |
Weighted residual factors for significantly intense reflections | 0.1395 |
Weighted residual factors for all reflections included in the refinement | 0.1545 |
Goodness-of-fit parameter for all reflections included in the refinement | 1.173 |
Diffraction radiation wavelength | 0.71073 Å |
Diffraction radiation type | MoKα |